Uploaded image for project: 'Sakai'
  1. Sakai
  2. SAK-20908

Upgrade Java version to JDK 7.x

    XMLWordPrintable

    Details

    • Type: Task
    • Status: CLOSED
    • Priority: Blocker
    • Resolution: Fixed
    • Affects Version/s: 2.9.0
    • Fix Version/s: 2.9.0, 10.0
    • Component/s: Install/Upgrade
    • Labels:
      None

      Description

      Relase of JDK 7.0 is right atound the corner with a a lot of anticipated feature including JVM support for other languages. I have tried to complied 2.8.x FRAMEWORK against release candidate and it was SUCCESSFUL with unit tests.
      Full profile for sakai 2.8.x failed. I see one error here which may be just package location movement. I am anticipating no more than a couple for more errors in compilation. deployment may be another deal.
      Here is the relevant build log.
      [ERROR] COMPILATION ERROR :
      [INFO] -------------------------------------------------------------
      [ERROR] /home/mustansar/source/sakai-2.8.x/profile2/util/src/java/org/sakaiproject/profile2/util/ProfileUtils.java:[49,31] error: package com.sun.image.codec.jpeg does not exist
      [ERROR] /home/mustansar/source/sakai-2.8.x/profile2/util/src/java/org/sakaiproject/profile2/util/ProfileUtils.java:[50,31] error: package com.sun.image.codec.jpeg does not exist
      [ERROR] /home/mustansar/source/sakai-2.8.x/profile2/util/src/java/org/sakaiproject/profile2/util/ProfileUtils.java:[143,6] error: cannot find symbol
      [ERROR] class ProfileUtils
      /home/mustansar/source/sakai-2.8.x/profile2/util/src/java/org/sakaiproject/profile2/util/ProfileUtils.java:[143,33] error: cannot find symbol
      [INFO] 4 errors
      [INFO] -------------------------------------------------------------
      [INFO] ------------------------------------------------------------------------
      [ERROR] BUILD FAILURE
      [INFO] ------------------------------------------------------------------------
      [INFO] Compilation failure

      /home/mustansar/source/sakai-2.8.x/profile2/util/src/java/org/sakaiproject/profile2/util/ProfileUtils.java:[49,31] error: package com.sun.image.codec.jpeg does not exist
      /home/mustansar/source/sakai-2.8.x/profile2/util/src/java/org/sakaiproject/profile2/util/ProfileUtils.java:[50,31] error: package com.sun.image.codec.jpeg does not exist
      /home/mustansar/source/sakai-2.8.x/profile2/util/src/java/org/sakaiproject/profile2/util/ProfileUtils.java:[143,6] error: cannot find symbol
      class ProfileUtils
      /home/mustansar/source/sakai-2.8.x/profile2/util/src/java/org/sakaiproject/profile2/util/ProfileUtils.java:[143,33] error: cannot find symbol

        Gliffy Diagrams

          Zeplin

            Attachments

              Issue Links

                Activity

                  People

                  Assignee:
                  ern Earle R Nietzel
                  Reporter:
                  mustansar Mustansar Mehmood
                  Votes:
                  0 Vote for this issue
                  Watchers:
                  6 Start watching this issue

                    Dates

                    Created:
                    Updated:
                    Resolved:

                      Git Integration