Uploaded image for project: 'Sakai'
  1. Sakai
  2. SAK-31598

Sakai Entity Broker REST Implementation test fails

    XMLWordPrintable

    Details

    • Type: Bug
    • Status: Awaiting Review
    • Priority: Minor
    • Resolution: Unresolved
    • Affects Version/s: 11.0
    • Fix Version/s: None
    • Component/s: Entity Broker
    • Environment:
      Debian Wheezy with Java 1.8.0_101 and Maven 3.0.5 (from Jessie).

      Description

      Basically, I followed the instructions after checkout of source code. No modifications to source code.

      The errors are:

      Tests run: 9, Failures: 1, Errors: 0, Skipped: 0, Time elapsed: 0.155 sec <<< FAILURE! - in org.sakaiproject.entitybroker.rest.EntityHandlerImplTest
      testHandleEntityAccessDescribe(org.sakaiproject.entitybroker.rest.EntityHandlerImplTest) Time elapsed: 0.033 sec <<< FAILURE!
      junit.framework.AssertionFailedError: null
      at junit.framework.Assert.fail(Assert.java:47)
      at junit.framework.Assert.assertTrue(Assert.java:20)
      at junit.framework.Assert.assertTrue(Assert.java:27)
      at org.sakaiproject.entitybroker.rest.EntityHandlerImplTest.testHandleEntityAccessDescribe(EntityHandlerImplTest.java:610)

      Running org.sakaiproject.entitybroker.rest.EntityDescriptionManagerTest
      Tests run: 3, Failures: 1, Errors: 0, Skipped: 0, Time elapsed: 0.006 sec <<< FAILURE! - in org.sakaiproject.entitybroker.rest.EntityDescriptionManagerTest
      testDescribeEntity(org.sakaiproject.entitybroker.rest.EntityDescriptionManagerTest) Time elapsed: 0.006 sec <<< FAILURE!
      junit.framework.AssertionFailedError: null
      at junit.framework.Assert.fail(Assert.java:47)
      at junit.framework.Assert.assertTrue(Assert.java:20)
      at junit.framework.Assert.assertTrue(Assert.java:27)
      at org.sakaiproject.entitybroker.rest.EntityDescriptionManagerTest.testDescribeEntity(EntityDescriptionManagerTest.java:119)
      Tests run: 17, Failures: 3, Errors: 0, Skipped: 0, Time elapsed: 13.121 sec <<< FAILURE! - in org.sakaiproject.entitybroker.rest.jetty.EntityBrokerServletTest
      testDescribeEntity(org.sakaiproject.entitybroker.rest.jetty.EntityBrokerServletTest) Time elapsed: 11.58 sec <<< FAILURE!
      java.lang.AssertionError: Could not parse the response to the request (/direct/myPrefix4/describe): org.mortbay.jetty.EofException
      at org.junit.Assert.fail(Assert.java:91)
      at org.sakaiproject.entitybroker.rest.jetty.EntityBrokerServletTest.fireRequest(EntityBrokerServletTest.java:136)
      at org.sakaiproject.entitybroker.rest.jetty.EntityBrokerServletTest.fireRequest(EntityBrokerServletTest.java:103)
      at org.sakaiproject.entitybroker.rest.jetty.EntityBrokerServletTest.testDescribeEntity(EntityBrokerServletTest.java:276)

      Failed tests:
      EntityDescriptionManagerTest.testDescribeEntity:119 null
      EntityHandlerImplTest.testHandleEntityAccessDescribe:610 null
      EntityBrokerServletTest.testDescribe:231->fireRequest:103->fireRequest:136 Could not parse the response to the request (/direct/describe): org.mortbay.jetty.EofException
      EntityBrokerServletTest.testDescribeEntity:276->fireRequest:103->fireRequest:136 Could not parse the response to the request (/direct/myPrefix4/describe): org.mortbay.jetty.EofException
      EntityBrokerServletTest.testDescribeXML:254->fireRequest:103->fireRequest:136 Could not parse the response to the request (/direct/describe.xml): org.mortbay.jetty.EofException

      Tests run: 54, Failures: 5, Errors: 0, Skipped: 0

        Gliffy Diagrams

          Zeplin

            Attachments

              Activity

                People

                Assignee:
                maintenanceteam Core Team
                Reporter:
                rmorales Rafael Morales
                Votes:
                0 Vote for this issue
                Watchers:
                2 Start watching this issue

                  Dates

                  Created:
                  Updated:

                    Git Integration